{"text_format":"1","workbook":"xlsx","n_sheets":8,"sheets":["Finish Times","Fleet 1","Finish Times (2)","Fleet 2","Fleet 3","Fleet 4","Fleet 1 and 2 Combo","Fleet 3 and 4 Combo"],"not_rendered":{"charts":0,"images":0,"macros":1,"external_links":0,"defined_names":6,"comments":5,"pivot_tables":0},"unopened":[],"bounds":{"document_bytes":16777216,"sheet_cells":100000,"rows_first":2000,"rows_last":500,"rows_between":2000,"halvings":0,"cell_chars":16384,"cell_head_chars":4096},"cells_cut":0,"cells_raw":0,"read":"whole","date_system":"1900"}

{"sheet":"Finish Times","index":0,"n_rows":40,"n_cols":8,"rows_kept":40,"cut":false,"hidden":false,"merged":[]}
[]
[]
[]
["MUST",null,"FLEET 1"]
["BE",null,"FLEET 2"]
["IN ALPHA",null,"FLEET 3"]
["ORDER",null,"FLEET 4"]
[null,null,null,null,null,"Finish Time"]
["BOAT NAME","FLEET","BOAT","SAIL #","SKIPPER","MINUTES","SECONDS"]
["Alarming",4,"S-2 9.2",505,"Oginz",47,9]
{"$rows_left_out":31}
{"sheet":"Fleet 1","index":1,"n_rows":29,"n_cols":37,"rows_kept":29,"cut":false,"hidden":false,"merged":[[4,0,4,14],[5,0,5,14],[6,0,6,14],[6,19,6,21],[7,6,7,7],[7,8,7,9],[7,10,7,11]]}
["Control Z to run macro",null,null,null,null,null,null,null,null,null,null,null,null,null,null,null,null,null,null,null,null,null,null,null,"Winner"]
[null,null,null,null,null,null,null,null,null,null,null,null,null,null,null,null,null,null,null,null,null,null,null,null,{"$f":"MIN(N10:N23)","v":51.978193146417446}]
[0,"<-----Minutes after first start"]
[]
["Blackwater Yacht Racing Association - Sign Up Sheet Fleet I (ONE)",null,null,null,null,null,null,null,null,null,null,null,null,null,null,null,null,null,null,null,null,null,null,null,null,"Test"]
["Date: Oct. 8, 2016      2016 Fall Series Race 6  RC: Short and Conover",null,null,null,null,null,null,null,null,null,null,null,null,null,null,null,null,null,null,null,null,null,null,null,"new tcf =","should ="]
["Windward Leeward Race in Bull Run with 13 to 23 mph wind",null,null,null,null,null,null,null,null,null,null,null,null,null,null,"Time","Time","Approx",null,"Finish Calculations",null,null,null,null,"Winner Adj Time","Winner Adj Time",null,null,"# of Boats"]
[null,null,null,null,null,null,"Handicap",null,"TCF",null,"Finish Time",null,"Calc(1)","Adj.(2)",null,"Behind","Behind","H'cap",null,"S for Spin",null,null,null,null,"/observed",null,null,null,{"$f":"MAX(AC10:AC23)","v":4}]
["Skipper","Boat Name","Initials","Guest?","Boat","Sail #","Spin*","Non-Spin*","Spin*","Non-Spin*","Min.","Sec.","Min.dd","Time","Place","Winner","Boat Ahead","to win",null,"N for non"]
["Cliborne","Bandit",null,null,"J/24",2792,170,{"$f":"IFERROR(G10+15,\"\")","v":185},{"$f":"IF(T10 = \"s\",1000/(900+G10),\"\")","v":0.93457943925233644},{"$f":"IF(T10 =\"n\",1000/(900+H10),\"\")","v":""},{"$f":"IF($AK10>0,(VLOOKUP($B10,'Finish Times'!$A$10:$G$40,6,FALSE)),\"\")","v":57},{"$f":"IF($AK10>0,(VLOOKUP($B10,'Finish Times'!$A$10:$G$40,7,FALSE)),\"\")","v":9},{"$f":"IF(AK10>0,(K10+L10/60)-A$3,\" \")","v":57.15},{"$f":"IFERROR(U10,\" \")","v":53.411214953271028},2,{"$f":"IFERROR(N10-$Y$2,\"\")","v":1.4330218068535814},1.4330218068535814,{"$f":"IFERROR(ROUND((1000/Y10)-900,0),\"\")","v":199},null,"s",{"$f":"IFERROR(IF(M10>0,IF(T10=\"s\",M10*I10,0)+IF(T10=\"n\",M10*J10,0),\" \"),\"\")","v":53.411214953271028},{"$f":"IFERROR(RANK(N10,$N$10:$N$23,1),\"\")","v":2},null,null,{"$f":"IFERROR($Y$2/M10,\"\")","v":0.90950469197580841},{"$f":"IFERROR(M10*Y10,\"\")","v":51.978193146417446},null,1,2,1.4330218068535814,1.4330218068535814,null,null,55,39,null,{"$f":"(VLOOKUP($B10,'Finish Times'!$A$10:$G$40,6,FALSE))","v":57}]
{"$rows_left_out":20}
{"sheet":"Finish Times (2)","index":2,"n_rows":39,"n_cols":7,"rows_kept":39,"cut":false,"hidden":true,"merged":[]}
[]
[]
[]
["MUST",null,"FLEET 1"]
["BE",null,"FLEET 2"]
["IN ALPHA",null,"FLEET 3"]
["ORDER",null,"FLEET 4"]
[null,null,null,null,null,"Finish Time"]
["BOAT NAME","FLEET","BOAT","SAIL #","SKIPPER","MINUTES","SECONDS"]
["Bandit",1,"J/24",2792,"Cliborne"]
{"$rows_left_out":30}
{"sheet":"Fleet 2","index":3,"n_rows":30,"n_cols":37,"rows_kept":30,"cut":false,"hidden":false,"merged":[[4,0,4,14],[5,0,5,14],[6,0,6,14],[6,19,6,21],[7,6,7,7],[7,8,7,9],[7,10,7,11]]}
[null,null,null,null,null,null,null,null,null,null,null,null,null,null,null,null,null,null,null,null,null,null,null,null,"Winner"]
[null,null,null,null,null,null,null,null,null,null,null,null,null,null,null,null,null,null,null,null,null,null,null,null,{"$f":"MIN(N10:N24)","v":59.647577092511014}]
[0,"<-----Minutes after first start"]
[]
["Blackwater Yacht Racing Association - Sign Up Sheet Fleet II (TWO)",null,null,null,null,null,null,null,null,null,null,null,null,null,null,null,null,null,null,null,null,null,null,null,null,"Test"]
["Date: Oct. 8, 2016      2016 Fall Series Race 6  RC: Short and Conover",null,null,null,null,null,null,null,null,null,null,null,null,null,null,null,null,null,null,null,null,null,null,null,"new tcf =","should ="]
["Windward Leeward Race in Bull Run with 13 to 23 mph wind",null,null,null,null,null,null,null,null,null,null,null,null,null,null,"Time","Time","Approx",null,"Finish Calculations",null,null,null,null,"Winner Adj Time","Winner Adj Time",null,null,"# of Boats"]
[null,null,null,null,null,null,"Handicap",null,"TCF",null,"Finish Time",null,"Calc(1)","Adj.(2)",null,"Behind","Behind","H'cap",null,"S for Spin",null,null,null,null,"/observed",null,null,null,{"$f":"MAX(AC10:AC24)","v":3}]
["Skipper","Boat Name","Initials","Guest?","Boat","Sail #","Spin*","Non-Spin*","Spin*","Non-Spin*","Min.","Sec.","Min.dd","Time","Place","Winner","Boat Ahead","to win",null,"N for non"]
["Theis","Gotcha",null,null,"S-2 6.7",75,208,{"$f":"IFERROR(G10+15,\"\")","v":223},{"$f":"IF(T10 = \"s\",1000/(900+G10),\"\")","v":0.90252707581227432},{"$f":"IF(T10 =\"n\",1000/(900+H10),\"\")","v":""},{"$f":"IF(AK10>0,VLOOKUP($B10,'Finish Times'!$A$10:$G$40,6,FALSE),\"\")","v":""},{"$f":"IF(AK10>0,VLOOKUP($B10,'Finish Times'!$A$10:$G$40,7,FALSE),\"\")","v":""},{"$f":"IF(AK10>0,(K10+L10/60)-A$3,\" \")","v":" "},{"$f":"IFERROR(U10,\" \")","v":""},"",{"$f":"IFERROR(N10-$Y$2,\"\")","v":""},"",{"$f":"IFERROR(ROUND((1000/Y10)-900,0),\"\")","v":""},null,"s",{"$f":"IFERROR(IF(M10>0,IF(T10=\"s\",M10*I10,0)+IF(T10=\"n\",M10*J10,0),\" \"),\"\")","v":""},{"$f":"IFERROR(RANK(N10,$N$10:$N$24,1),\"\")","v":""},null,null,{"$f":"IFERROR($Y$2/M10,\"\")","v":""},{"$f":"IFERROR(M10*Y10,\"\")","v":""},null,1,"","","",null,null,55,39,null,{"$f":"VLOOKUP($B10,'Finish Times'!$A$10:$G$40,6,FALSE)","v":0}]
{"$rows_left_out":21}
{"sheet":"Fleet 3","index":4,"n_rows":30,"n_cols":37,"rows_kept":30,"cut":false,"hidden":false,"merged":[[4,0,4,14],[5,0,5,14],[6,0,6,14],[6,19,6,21],[7,6,7,7],[7,8,7,9],[7,10,7,11]]}
[null,null,null,null,null,null,null,null,null,null,null,null,null,null,null,null,null,null,null,null,null,null,null,null,"Winner"]
[null,null,null,null,null,null,null,null,null,null,null,null,null,null,null,null,null,null,null,null,null,null,null,null,{"$f":"MIN(N10:N24)","v":34.067991933160471}]
[5,"<-----Minutes after first start"]
[]
["Blackwater Yacht Racing Association - Sign Up Sheet Fleet III (THREE)",null,null,null,null,null,null,null,null,null,null,null,null,null,null,null,null,null,null,null,null,null,null,null,null,"Test"]
["Date: Oct. 8, 2016      2016 Fall Series Race 6  RC: Short and Conover",null,null,null,null,null,null,null,null,null,null,null,null,null,null,null,null,null,null,null,null,null,null,null,"new tcf =","should ="]
["Windward Leeward Race in Bull Run with 13 to 23 mph wind",null,null,null,null,null,null,null,null,null,null,null,null,null,null,"Time","Time","Approx",null,"Finish Calculations",null,null,null,null,"Winner Adj Time","Winner Adj Time",null,null,"# of Boats"]
[null,null,null,null,null,null,"Handicap",null,"TCF",null,"Finish Time",null,"Calc(1)","Adj.(2)",null,"Behind","Behind","H'cap",null,"S for Spin",null,null,null,null,"/observed",null,null,null,{"$f":"MAX(AC10:AC24)","v":3}]
["Skipper","Boat Name","Initials","Guest?","Boat","Sail #","Spin*","Non-Spin*","Spin*","Non-Spin*","Min.","Sec.","Min.dd","Time","Place","Winner","Boat Ahead","to win",null,"N for non"]
["Perdue","Miss Virginia",null,null,"Hunter 23.5",1309,244,{"$f":"IFERROR(G10+15,\"\")","v":259},{"$f":"IF(T10 = \"s\",1000/(900+G10),\"\")","v":0.87412587412587417},{"$f":"IF(T10 =\"n\",1000/(900+H10),\"\")","v":""},{"$f":"IF(AK10>0,VLOOKUP($B10,'Finish Times'!$A$10:$G$40,6,FALSE),\" \")","v":50},{"$f":"IF(AK10>0,VLOOKUP($B10,'Finish Times'!$A$10:$G$40,7,FALSE),\" \")","v":23},{"$f":"IF(AK10>0,(K10+L10/60)-A$3,\" \")","v":45.383333333333333},{"$f":"IFERROR(U10,\" \")","v":39.670745920745922},3,{"$f":"IFERROR(N10-$Y$2,\"\")","v":5.6027539875854515},4.1151903651903652,{"$f":"IFERROR(ROUND((1000/Y10)-900,0),\"\")","v":432},null,"s",{"$f":"IFERROR(IF(M10>0,IF(T10=\"s\",M10*I10,0)+IF(T10=\"n\",M10*J10,0),\" \"),\"\")","v":39.670745920745922},{"$f":"IFERROR(RANK(N10,$N$10:$N$24,1),\"\")","v":3},null,null,{"$f":"IFERROR($Y$2/M10,\"\")","v":0.75067187513390687},{"$f":"IFERROR(M10*Y10,\"\")","v":34.067991933160471},null,1,3,5.6027539875854515,4.1151903651903652,null,null,55,39,null,{"$f":"VLOOKUP($B10,'Finish Times'!$A$10:$G$40,6,FALSE)","v":50}]
{"$rows_left_out":21}
{"sheet":"Fleet 4","index":5,"n_rows":29,"n_cols":37,"rows_kept":29,"cut":false,"hidden":false,"merged":[[4,0,4,14],[5,0,5,14],[6,0,6,14],[6,19,6,21],[7,6,7,7],[7,8,7,9],[7,10,7,11]]}
[null,null,null,null,null,null,null,null,null,null,null,null,null,null,null,null,null,null,null,null,null,null,null,null,"Winner"]
[null,null,null,null,null,null,null,null,null,null,null,null,null,null,null,null,null,null,null,null,null,null,null,null,{"$f":"MIN(N10:N23)","v":32.747219717463182}]
[5,"<-----Minutes after first start"]
[]
["Blackwater Yacht Racing Association - Sign Up Sheet Fleet IV (FOUR)",null,null,null,null,null,null,null,null,null,null,null,null,null,null,null,null,null,null,null,null,null,null,null,null,"Test"]
["Date: Oct. 8, 2016      2016 Fall Series Race 6  RC: Short and Conover",null,null,null,null,null,null,null,null,null,null,null,null,null,null,null,null,null,null,null,null,null,null,null,"new tcf =","should ="]
["Windward Leeward Race in Bull Run with 13 to 23 mph wind",null,null,null,null,null,null,null,null,null,null,null,null,null,null,"Time","Time","Approx",null,"Finish Calculations",null,null,null,null,"Winner Adj Time","Winner Adj Time",null,null,"# of Boats"]
[null,null,null,null,null,null,"Handicap",null,"TCF",null,"Finish Time",null,"Calc(1)","Adj.(2)",null,"Behind","Behind","H'cap",null,"S for Spin",null,null,null,null,"/observed",null,null,null,{"$f":"MAX(AC10:AC23)","v":3}]
["Skipper","Boat Name","Initials","Guest?","Boat","Sail #","Spin*","Non-Spin*","Spin*","Non-Spin*","Min.","Sec.","Min.dd","Time","Place","Winner","Boat Ahead","to win",null,"N for non"]
["DeMestro","Little Wing",null,null,"Beneteau 29",485,168,{"$f":"IFERROR(G10+15,\"\")","v":183},{"$f":"IF(T10 = \"s\",1000/(900+G10),\"\")","v":""},{"$f":"IF(T10 =\"n\",1000/(900+H10),\"\")","v":0.92336103416435822},{"$f":"IF(AK10>0,VLOOKUP($B10,'Finish Times'!$A$10:$G$40,6,FALSE),\" \")","v":41},{"$f":"IF(AK10>0,VLOOKUP($B10,'Finish Times'!$A$10:$G$40,7,FALSE),\" \")","v":32},{"$f":"IF(AK10>0,(K10+L10/60)-A$3,\" \")","v":36.533333333333331},{"$f":"IFERROR(U10,\" \")","v":33.733456448137886},2,{"$f":"IFERROR(N10-$Y$2,\"\")","v":0.98623673067470463},0.98623673067470463,{"$f":"IFERROR(ROUND((1000/Y10)-900,0),\"\")","v":216},null,"n",{"$f":"IFERROR(IF(M10>0,IF(T10=\"s\",M10*I10,0)+IF(T10=\"n\",M10*J10,0),\" \"),\"\")","v":33.733456448137886},{"$f":"IFERROR(RANK(N10,$N$10:$N$23,1),\"\")","v":2},null,null,{"$f":"IFERROR($Y$2/M10,\"\")","v":0.89636550321523312},{"$f":"IFERROR(M10*Y10,\"\")","v":32.747219717463182},null,1,2,0.98623673067470463,0.98623673067470463,null,null,55,39,null,{"$f":"VLOOKUP($B10,'Finish Times'!$A$10:$G$40,6,FALSE)","v":41}]
{"$rows_left_out":20}
{"sheet":"Fleet 1 and 2 Combo","index":6,"n_rows":33,"n_cols":37,"rows_kept":33,"cut":false,"hidden":false,"merged":[[4,0,4,14],[5,0,5,14],[6,0,6,14],[6,19,6,21],[7,6,7,7],[7,8,7,9],[7,10,7,11]]}
["Control Z to run macro",null,null,null,null,null,null,null,null,null,null,null,null,null,null,null,null,null,null,null,null,null,null,null,"Winner"]
[null,null,null,null,null,null,null,null,null,null,null,null,null,null,null,null,null,null,null,null,null,null,null,null,{"$f":"MIN(N10:N27)","v":51.978193146417446}]
[0,"<-----Minutes after first start"]
[]
["Blackwater Yacht Racing Association - Race Results Fleets I & 2",null,null,null,null,null,null,null,null,null,null,null,null,null,null,null,null,null,null,null,null,null,null,null,null,"Test"]
["Date: Oct. 8, 2016      2016 Fall Series Race 6  RC: Short and Conover",null,null,null,null,null,null,null,null,null,null,null,null,null,null,null,null,null,null,null,null,null,null,null,"new tcf =","should ="]
["Windward Leeward Race in Bull Run with 13 to 23 mph wind",null,null,null,null,null,null,null,null,null,null,null,null,null,null,"Time","Time","Approx",null,"Finish Calculations",null,null,null,null,"Winner Adj Time","Winner Adj Time",null,null,"# of Boats"]
[null,null,null,null,null,null,"Handicap",null,"TCF",null,"Finish Time",null,"Calc(1)","Adj.(2)",null,"Behind","Behind","H'cap",null,"S for Spin",null,null,null,null,"/observed",null,null,null,{"$f":"MAX(AC10:AC27)","v":7}]
["Skipper","Boat Name","Initials","Guest?","Boat","Sail #","Spin*","Non-Spin*","Spin*","Non-Spin*","Min.","Sec.","Min.dd","Time","Place","Winner","Boat Ahead","to win",null,"N for non"]
["Cliborne","Bandit",null,null,"J/24",2792,170,{"$f":"IFERROR(G10+15,\"\")","v":185},{"$f":"IF(T10 = \"s\",1000/(900+G10),\"\")","v":0.93457943925233644},{"$f":"IF(T10 =\"n\",1000/(900+H10),\"\")","v":""},{"$f":"IF($AK10>0,(VLOOKUP($B10,'Finish Times'!$A$10:$G$40,6,FALSE)),\"\")","v":57},{"$f":"IF($AK10>0,(VLOOKUP($B10,'Finish Times'!$A$10:$G$40,7,FALSE)),\"\")","v":9},{"$f":"IF(AK10>0,(K10+L10/60)-A$3,\" \")","v":57.15},{"$f":"IFERROR(U10,\" \")","v":53.411214953271028},2,{"$f":"IFERROR(N10-$Y$2,\"\")","v":1.4330218068535814},1.4330218068535814,{"$f":"IFERROR(ROUND((1000/Y10)-900,0),\"\")","v":199},null,"s",{"$f":"IFERROR(IF(M10>0,IF(T10=\"s\",M10*I10,0)+IF(T10=\"n\",M10*J10,0),\" \"),\"\")","v":53.411214953271028},{"$f":"IFERROR(RANK(N10,$N$10:$N$27,1),\"\")","v":2},null,null,{"$f":"IFERROR($Y$2/M10,\"\")","v":0.90950469197580841},{"$f":"IFERROR(M10*Y10,\"\")","v":51.978193146417446},null,1,2,1.4330218068535814,1.4330218068535814,null,null,55,39,null,{"$f":"(VLOOKUP($B10,'Finish Times'!$A$10:$G$40,6,FALSE))","v":57}]
{"$rows_left_out":24}
{"sheet":"Fleet 3 and 4 Combo","index":7,"n_rows":29,"n_cols":37,"rows_kept":29,"cut":false,"hidden":false,"merged":[[4,0,4,14],[5,0,5,14],[6,0,6,14],[6,19,6,21],[7,6,7,7],[7,8,7,9],[7,10,7,11]]}
[null,null,null,null,null,null,null,null,null,null,null,null,null,null,null,null,null,null,null,null,null,null,null,null,"Winner"]
[null,null,null,null,null,null,null,null,null,null,null,null,null,null,null,null,null,null,null,null,null,null,null,null,{"$f":"MIN(N10:N23)","v":32.747219717463182}]
[5,"<-----Minutes after first start"]
[]
["Blackwater Yacht Racing Association - Race Results Fleets 3 & 4",null,null,null,null,null,null,null,null,null,null,null,null,null,null,null,null,null,null,null,null,null,null,null,null,"Test"]
["Date: October 6, 2016     2016 Fall Series Race 6    RC: Short and Conover",null,null,null,null,null,null,null,null,null,null,null,null,null,null,null,null,null,null,null,null,null,null,null,"new tcf =","should ="]
[null,null,null,null,null,null,null,null,null,null,null,null,null,null,null,"Time","Time","Approx",null,"Finish Calculations",null,null,null,null,"Winner Adj Time","Winner Adj Time",null,null,"# of Boats"]
[null,null,null,null,null,null,"Handicap",null,"TCF",null,"Finish Time",null,"Calc(1)","Adj.(2)",null,"Behind","Behind","H'cap",null,"S for Spin",null,null,null,null,"/observed",null,null,null,{"$f":"MAX(AC10:AC23)","v":6}]
["Skipper","Boat Name","Initials","Guest?","Boat","Sail #","Spin*","Non-Spin*","Spin*","Non-Spin*","Min.","Sec.","Min.dd","Time","Place","Winner","Boat Ahead","to win",null,"N for non"]
["Perdue","Miss Virginia",null,null,"Hunter 23.5",1309,244,{"$f":"IFERROR(G10+15,\"\")","v":259},{"$f":"IF(T10 = \"s\",1000/(900+G10),\"\")","v":0.87412587412587417},{"$f":"IF(T10 =\"n\",1000/(900+H10),\"\")","v":""},{"$f":"IF($AK10>0,(VLOOKUP($B10,'Finish Times'!$A$10:$G$40,6,FALSE)),\"\")","v":50},{"$f":"IF($AK10>0,(VLOOKUP($B10,'Finish Times'!$A$10:$G$40,7,FALSE)),\"\")","v":23},{"$f":"IF(AK10>0,(K10+L10/60)-A$3,\" \")","v":45.383333333333333},{"$f":"IFERROR(U10,\" \")","v":39.670745920745922},6,{"$f":"IFERROR(N10-$Y$2,\"\")","v":6.9235262032827407},1.4913980946589689,{"$f":"IFERROR(ROUND((1000/Y10)-900,0),\"\")","v":486},null,"s",{"$f":"IFERROR(IF(M10>0,IF(T10=\"s\",M10*I10,0)+IF(T10=\"n\",M10*J10,0),\" \"),\"\")","v":39.670745920745922},{"$f":"IFERROR(RANK(N10,$N$10:$N$23,1),\"\")","v":6},null,null,{"$f":"IFERROR($Y$2/M10,\"\")","v":0.7215692923421928},{"$f":"IFERROR(M10*Y10,\"\")","v":32.747219717463182},null,1,6,6.9235262032827407,1.4913980946589689,null,null,55,39,null,{"$f":"(VLOOKUP($B10,'Finish Times'!$A$10:$G$40,6,FALSE))","v":50}]
{"$rows_left_out":19}